2.6.24-rc3-mm2 - Build Failure on powerpc timerfd() undeclared

Kamalesh Babulal kamalesh at linux.vnet.ibm.com
Wed Nov 28 23:40:47 EST 2007

Hi Andrew,

Kernel build fails, with build error

  CC      arch/powerpc/platforms/cell/spu_callbacks.o
In file included from arch/powerpc/platforms/cell/spu_callbacks.c:49:
include/asm/systbl.h:312: error: ‘sys_timerfd’ undeclared here (not in a function)
make[2]: *** [arch/powerpc/platforms/cell/spu_callbacks.o] Error 1
make[1]: *** [arch/powerpc/platforms/cell] Error 2
make: *** [arch/powerpc/platforms] Error 2

Thanks & Regards,
Kamalesh Babulal,
Linux Technology Center,

More information about the Linuxppc-dev mailing list