[PATCH] 2.6.24-rc1-git9 - Missing include file in kallsyms.h

Kamalesh Babulal kamalesh at linux.vnet.ibm.com
Thu Nov 1 19:35:27 EST 2007

The Build with randconfig fails with following error with the

include/linux/kallsyms.h:56: error: ‘NULL’ undeclared (first use in this
include/linux/kallsyms.h:56: error: (Each undeclared identifier is
reported only once
include/linux/kallsyms.h:56: error: for each function it appears in.)
make[2]: *** [arch/powerpc/platforms/cell/spu_callbacks.o] Error 1
make[1]: *** [arch/powerpc/platforms/cell] Error 2
make: *** [arch/powerpc/platforms] Error 2

Signed-off-by: Kamalesh Babulal <kamalesh at linux.vnet.ibm.com>
diff --git a/include/linux/kallsyms.h b/include/linux/kallsyms.h
index f73de6f..82de2fb 100644
--- a/include/linux/kallsyms.h
+++ b/include/linux/kallsyms.h
@@ -6,6 +6,7 @@
 #include <linux/errno.h>
+#include <linux/stddef.h>
 #define KSYM_NAME_LEN 128
 #define KSYM_SYMBOL_LEN (sizeof("%s+%#lx/%#lx [%s]") + (KSYM_NAME_LEN - 1) + \

Thanks & Regards,
Kamalesh Babulal,
Linux Technology Center,

More information about the Linuxppc-dev mailing list